BDBM50008587 2-(1-Methyl-piperidin-4-yl)-indan-1-one::CHEMBL348318
SMILES CN1CCC(CC1)C1Cc2ccccc2C1=O
InChI Key InChIKey=MYHFJXQJXDZOAD-UHFFFAOYSA-N
Data  1 IC50
  Tab Delimited (TSV)   2D SDfile   Computed 3D by Vconf -m prep SDfile
Find this compound or compounds like it in BindingDB:
Activity Spreadsheet -- Enzyme Inhibition Constant Data from BindingDB
Found 1 hit for monomerid = 50008587
TargetAcetylcholinesterase(Homo sapiens (Human))
University Of Illinois
Curated by ChEMBL
LigandPNGBDBM50008587(2-(1-Methyl-piperidin-4-yl)-indan-1-one | CHEMBL34...)
Affinity DataIC50:  3.30E+3nM. Assay description: Inhibition of acetylcholinesterase activity
In DepthDetails ArticlePubMed