BDBM50008668 (R)-6-Hydroxy-naphthalene-2-carboxylic acid [1-dipentylcarbamoyl-2-(1H-indol-3-yl)-ethyl]-amide::CHEMBL113041
SMILES CCCCCN(CCCCC)C(=O)[C@@H](Cc1c[nH]c2ccccc12)NC(=O)c1ccc2cc(O)ccc2c1
InChI Key InChIKey=OCJWTEOWJCRLKQ-SSEXGKCCSA-N
Data  2 IC50
  Tab Delimited (TSV)   2D SDfile   Computed 3D by Vconf -m prep SDfile
Find this compound or compounds like it in BindingDB:
Activity Spreadsheet -- Enzyme Inhibition Constant Data from BindingDB
Found 2 hits for monomerid = 50008668
TargetGastrin/cholecystokinin type B receptor(Homo sapiens (Human))
Abbott Laboratories
Curated by ChEMBL
LigandPNGBDBM50008668((R)-6-Hydroxy-naphthalene-2-carboxylic acid [1-dip...)
Affinity DataIC50: >1.00E+4nM. Assay description: Inhibition of [125I]-Bolton-Hunter CCK-8 binding to cholecystokinin type B receptor in guinea pig cerebral cortical.
In DepthDetails ArticlePubMed
TargetCholecystokinin receptor type A(Cavia porcellus)
Abbott Laboratories
Curated by ChEMBL
LigandPNGBDBM50008668((R)-6-Hydroxy-naphthalene-2-carboxylic acid [1-dip...)
Affinity DataIC50:  5.20E+3nM. Assay description: Inhibition of [125I]-Bolton-Hunter CCK-8 binding to cholecystokinin type A receptor in guinea pig pancreatic membranes.
In DepthDetails ArticlePubMed