BDBM50008890 2-(4-Hydroxy-phenyl)-1-(2-pyrrolidin-1-ylmethyl-piperidin-1-yl)-ethanone(HCl)::CHEMBL128912
SMILES Oc1ccc(CC(=O)N2CCCCC2CN2CCCC2)cc1
InChI Key InChIKey=ZXDHAKBZZDCMGU-UHFFFAOYSA-N
Data  3 KI
  Tab Delimited (TSV)   2D SDfile   Computed 3D by Vconf -m prep SDfile
Find this compound or compounds like it in BindingDB:
Activity Spreadsheet -- Enzyme Inhibition Constant Data from BindingDB
Found 3 hits for monomerid = 50008890
TargetKappa-type opioid receptor(Cavia porcellus (domestic guinea pig))
Zambeletti Research Laboratories
Curated by ChEMBL
LigandPNGBDBM50008890(2-(4-Hydroxy-phenyl)-1-(2-pyrrolidin-1-ylmethyl-pi...)
Affinity DataKi:  194nM. Assay description: Displacement of [3H]-U-69,593 from kappa opioid receptors in guine pig brain (minus cerebellum).
In DepthDetails ArticlePubMed
TargetMu-type opioid receptor(GUINEA PIG)
Zambeletti Research Laboratories
Curated by ChEMBL
LigandPNGBDBM50008890(2-(4-Hydroxy-phenyl)-1-(2-pyrrolidin-1-ylmethyl-pi...)
Affinity DataKi: >1.00E+4nM. Assay description: Displacement of [3H]-DAGO from mu opioid receptors in guinea pig brain (minus cerebellum).
In DepthDetails ArticlePubMed
TargetDelta-type opioid receptor(Homo sapiens (Human))
Zambeletti Research Laboratories
Curated by ChEMBL
LigandPNGBDBM50008890(2-(4-Hydroxy-phenyl)-1-(2-pyrrolidin-1-ylmethyl-pi...)
Affinity DataKi: >1.00E+4nM. Assay description: Compound was evaluated for its binding affinity against opioid receptor delta subtype in guinea pig brain (minus cerebellum)using [3H]-DADLE as radio...
In DepthDetails ArticlePubMed