BDBM50008951 2,6-Di-tert-butyl-4-[2-(3-trifluoromethyl-isoxazol-5-yl)-vinyl]-phenol::CHEMBL149448
SMILES CC(C)(C)c1cc(\C=C\c2cc(no2)C(F)(F)F)cc(c1O)C(C)(C)C
InChI Key InChIKey=DCHZZAGSYLWIDD-BQYQJAHWSA-N
Data  2 IC50
  Tab Delimited (TSV)   2D SDfile   Computed 3D by Vconf -m prep SDfile
Find this compound or compounds like it in BindingDB:
Activity Spreadsheet -- Enzyme Inhibition Constant Data from BindingDB
Found 2 hits for monomerid = 50008951
TargetProstaglandin G/H synthase 1/2(RAT)
Warner-Lambert
Curated by ChEMBL
LigandPNGBDBM50008951(2,6-Di-tert-butyl-4-[2-(3-trifluoromethyl-isoxazol...)
Affinity DataIC50: >3.00E+4nM. Assay description: Inhibitory activity against cyclooxygenase in rat basophilic leukemia cells using prostaglandin G/H synthase assay
In DepthDetails ArticlePubMed
TargetPolyunsaturated fatty acid 5-lipoxygenase(Rattus norvegicus)
Warner-Lambert
Curated by ChEMBL
LigandPNGBDBM50008951(2,6-Di-tert-butyl-4-[2-(3-trifluoromethyl-isoxazol...)
Affinity DataIC50: >3.00E+4nM. Assay description: Inhibitory activity against 5-lipoxygenase in rat basophilic leukemia cells
In DepthDetails ArticlePubMed