BDBM50008960 2-Methoxy-4-[2-(3-methyl-isoxazol-5-yl)-vinyl]-phenol::CHEMBL151608
SMILES COc1cc(\C=C\c2cc(C)no2)ccc1O
InChI Key InChIKey=JTNZBHKXZNSYRS-HWKANZROSA-N
Data  2 IC50
  Tab Delimited (TSV)   2D SDfile   Computed 3D by Vconf -m prep SDfile
Find this compound or compounds like it in BindingDB:
Activity Spreadsheet -- Enzyme Inhibition Constant Data from BindingDB
Found 2 hits for monomerid = 50008960
TargetProstaglandin G/H synthase 1/2(RAT)
Warner-Lambert
Curated by ChEMBL
LigandPNGBDBM50008960(2-Methoxy-4-[2-(3-methyl-isoxazol-5-yl)-vinyl]-phe...)
Affinity DataIC50:  1.20E+4nM. Assay description: Inhibitory activity against cyclooxygenase in rat basophilic leukemia cells using prostaglandin G/H synthase assay
In DepthDetails ArticlePubMed
TargetPolyunsaturated fatty acid 5-lipoxygenase(Rattus norvegicus)
Warner-Lambert
Curated by ChEMBL
LigandPNGBDBM50008960(2-Methoxy-4-[2-(3-methyl-isoxazol-5-yl)-vinyl]-phe...)
Affinity DataIC50:  5.50E+3nM. Assay description: Inhibitory activity against 5-lipoxygenase in rat basophilic leukemia cells
In DepthDetails ArticlePubMed