BDBM50009069 (S)-3-(2-Carboxy-ethylsulfanyl)-3-[2-(8-phenyl-octyl)-phenyl]-propionic acid::3-(2-Carboxy-ethylsulfanyl)-3-[2-(8-phenyl-octyl)-phenyl]-propionic acid(SKF 106203)::CHEMBL21595
SMILES OC(=O)CCS[C@@H](CC(O)=O)c1ccccc1CCCCCCCCc1ccccc1
InChI Key InChIKey=QTZPRMCKSZATQD-DEOSSOPVSA-N
Data  1 KI
  Tab Delimited (TSV)   2D SDfile   Computed 3D by Vconf -m prep SDfile
Find this compound or compounds like it in BindingDB:
Activity Spreadsheet -- Enzyme Inhibition Constant Data from BindingDB
Found 1 hit for monomerid = 50009069
TargetCysteinyl leukotriene receptor 1(GUINEA PIG)
Ici Pharmaceuticals Group
Curated by ChEMBL
LigandPNGBDBM50009069((S)-3-(2-Carboxy-ethylsulfanyl)-3-[2-(8-phenyl-oct...)
Affinity DataKi:  60nM. Assay description: Compound was evaluated for its ability to displace [3H]-LTD4 from Cysteinyl leukotriene D4 receptor in guinea pig lung membranes
In DepthDetails ArticlePubMed