BDBM50009102 CHEMBL3238301
SMILES CC#C[C@H]1CN(CCN1c1ccc(cc1)S(=N)(=O)C(F)(F)F)S(=O)(=O)c1ccc(N)nc1
InChI Key InChIKey=ULWPZVFGWXVNBJ-NENZQZOMSA-N
Data  1 IC50  1 EC50
PDB links: 1 PDB ID matches this monomer.
  Tab Delimited (TSV)   2D SDfile   Computed 3D by Vconf -m prep SDfile
Find this compound or compounds like it in BindingDB:
Activity Spreadsheet -- Enzyme Inhibition Constant Data from BindingDB
Found 2 hits for monomerid = 50009102
TargetGlucokinase regulatory protein(Mus musculus)
Amgen
Curated by ChEMBL
LigandPNGBDBM50009102(CHEMBL3238301)
Affinity DataEC50:  567nM. Assay description: Inhibition of GKRP-GK interaction in mouse hepatocytes assessed as induction of GK translocation from nucleus to cytoplasm incubated for 20 mins prio...
In DepthDetails ArticlePubMed
TargetGlucokinase regulatory protein(Homo sapiens (Human))
Amgen
Curated by ChEMBL
LigandPNGBDBM50009102(CHEMBL3238301)
Affinity DataIC50:  45nM. Assay description: Inhibition of biotin-tagged human GKRP/fluorescein-tagged GK interaction preincubated for 20 mins prior to GK addition measured after 2 to 4 hrs by A...