BDBM50009139 3-{2-[2-(2-{2-[2-Amino-3-(4-hydroxy-phenyl)-propionylamino]-propionylamino}-3-phenyl-propionylamino)-3-methyl-butyrylamino]-3-methyl-butyrylamino}-N-carbamoylmethyl-succinamic acid::CHEMBL287207
SMILES CC(C)[C@H](NC(=O)[C@H](Cc1ccccc1)NC(=O)[C@H](C)NC(=O)[C@@H](N)Cc1ccc(O)cc1)C(=O)N[C@@H](C(C)C)C(=O)N[C@@H](CC(O)=O)C(=O)NCC(N)=O
InChI Key InChIKey=YKGXQQSRQAARFJ-PKNMDTBHSA-N
Data  2 KI
  Tab Delimited (TSV)   2D SDfile   Computed 3D by Vconf -m prep SDfile
Find this compound or compounds like it in BindingDB:
Activity Spreadsheet -- Enzyme Inhibition Constant Data from BindingDB
Found 2 hits for monomerid = 50009139
TargetDelta-type opioid receptor(Rattus norvegicus (rat))
National Institute Of Environmental Health Sciences
Curated by ChEMBL
LigandPNGBDBM50009139(3-{2-[2-(2-{2-[2-Amino-3-(4-hydroxy-phenyl)-propio...)
Affinity DataKi:  9.40nM. Assay description: Binding affinity against Opioid receptor delta 1 in P2 membrane preparation of rat brain by [3H]DADLE displacement.
In DepthDetails ArticlePubMed
TargetMu-type opioid receptor(Rattus norvegicus (rat))
National Institute Of Environmental Health Sciences
Curated by ChEMBL
LigandPNGBDBM50009139(3-{2-[2-(2-{2-[2-Amino-3-(4-hydroxy-phenyl)-propio...)
Affinity DataKi:  150nM. Assay description: Binding affinity against Opioid receptor mu 1 in P2 membrane preparation of rat brain by [3H]DAGO displacement.
In DepthDetails ArticlePubMed