BDBM50009259 1-aminobutyloxycarbonyl-2-phenyl-(1S)-ethyl[2-[1-[1-carbamoyl-2-phenyl-(1S)-ethylcarbamoyl]-3-methyl-(1S)-butylcarbamoyl]-3-phenyl-(2R)-propyl]phosphinic acid::CHEMBL3350608
SMILES CC(C)C[C@H](NC(=O)[C@H](Cc1ccccc1)CP(O)(=O)[C@H](Cc1ccccc1)NC(=O)OC(C)(C)C)C(=O)N[C@@H](Cc1ccccc1)C(N)=O
InChI Key InChIKey=WWGGSNOTVLVDPE-YRCZKMHPSA-N
Data  1 IC50
  Tab Delimited (TSV)   2D SDfile   Computed 3D by Vconf -m prep SDfile
Find this compound or compounds like it in BindingDB:
Activity Spreadsheet -- Enzyme Inhibition Constant Data from BindingDB
Found 1 hit for monomerid = 50009259
TargetGag-Pol polyprotein [489-587](Human immunodeficiency virus type 1)
Merck Sharp And Dohme Research Laboratories
Curated by ChEMBL
LigandPNGBDBM50009259(1-aminobutyloxycarbonyl-2-phenyl-(1S)-ethyl[2-[1-[...)
Affinity DataIC50:  9nM. Assay description: The compound was tested for its affinity against HIV-1 protease
In DepthDetails ArticlePubMed