BDBM50009261 CHEMBL296115::L-685434::[1-Benzyl-2-hydroxy-4-(2-hydroxy-indan-1-ylcarbamoyl)-5-phenyl-pentyl]-carbamic acid tert-butyl ester
SMILES CC(C)(C)OC(=O)N[C@@H](Cc1ccccc1)[C@@H](O)C[C@@H](Cc1ccccc1)C(=O)N[C@@H]1[C@H](O)Cc2ccccc12
InChI Key InChIKey=ZJBUCZFZQXPYFC-KIWMWGIHSA-N
Data  1 IC50
  Tab Delimited (TSV)   2D SDfile   Computed 3D by Vconf -m prep SDfile
Find this compound or compounds like it in BindingDB:
Activity Spreadsheet -- Enzyme Inhibition Constant Data from BindingDB
Found 1 hit for monomerid = 50009261
TargetGag-Pol polyprotein [489-587](Human immunodeficiency virus type 1)
Merck Sharp And Dohme Research Laboratories
Curated by ChEMBL
LigandPNGBDBM50009261(CHEMBL296115 | L-685434 | [1-Benzyl-2-hydroxy-4-(2...)
Affinity DataIC50:  0.300nM. Assay description: The compound was tested for its affinity against HIV-1 protease
In DepthDetails ArticlePubMed