BDBM50009409 6-{2-[8-(4-Chloro-benzyloxy)-2,6-dimethyl-1,2,6,7,8,8a-hexahydro-naphthalen-1-yl]-ethyl}-4-hydroxy-tetrahydro-pyran-2-one::CHEMBL309410
SMILES C[C@@H]1C[C@H](OCc2ccc(Cl)cc2)[C@@H]2[C@@H](CCC3C[C@@H](O)CC(=O)O3)[C@@H](C)C=CC2=C1
InChI Key InChIKey=ADZPEGVGCRMCJB-HFFWVFNMSA-N
Data  1 IC50
  Tab Delimited (TSV)   2D SDfile   Computed 3D by Vconf -m prep SDfile
Find this compound or compounds like it in BindingDB:
Activity Spreadsheet -- Enzyme Inhibition Constant Data from BindingDB
Found 1 hit for monomerid = 50009409
Target3-hydroxy-3-methylglutaryl-coenzyme A reductase(Rattus norvegicus (rat))
Merck Sharp & Dohme Research Laboratories
Curated by ChEMBL
LigandPNGBDBM50009409(6-{2-[8-(4-Chloro-benzyloxy)-2,6-dimethyl-1,2,6,7,...)
Affinity DataIC50:  170nM. Assay description: In vitro inhibitory activity of the compound against rat liver HMG-CoA reductase enzyme
In DepthDetails ArticlePubMed