BDBM500096 US11021457, Compound 108
SMILES O=C1N(Cc2c1cccc2NCCNC=C1C(=O)CC(CC1=O)c1ccccc1)C1CCC(=O)NC1=O
InChI Key InChIKey=ZZDTYYNFSSYXAC-HKWRFOASSA-N
Data  1 IC50
  Tab Delimited (TSV)   2D SDfile   Computed 3D by Vconf -m prep SDfile
Find this compound or compounds like it in BindingDB:
Activity Spreadsheet -- Enzyme Inhibition Constant Data from BindingDB
Found 1 hit for monomerid = 500096
TargetMicrotubule-associated proteins 1A/1B light chain 3B(Human)
Wigen Biomedicine Technology (Shanghai)
US Patent
LigandPNGBDBM500096(US11021457, Compound 108)
Affinity DataIC50:  750nM. Assay description: By constructing a prokaryotic expression system, the LC3B protein was successfully expressed and purified, and a preliminary screening and verificati...
Ligand InfoPC cidPC sid
In DepthDetails US Patent