BDBM50009624 CHEMBL327811::[1-(13-Cyclohexylmethyl-11,12-dihydroxy-2,6-dioxo-1,7diaza-cyclotridec-3-ylcarbamoyl)-2-phenyl-ethyl]-carbamic acid tert-butyl ester
SMILES CC(C)(C)OC(=O)N[C@@H](Cc1ccccc1)C(=O)N[C@H]1CCC(=O)NCCC[C@@H](O)[C@H](O)[C@H](CC2CCCCC2)NC1=O
InChI Key InChIKey=IXGDPPFLARWURZ-YYDZWWTMSA-N
Data  1 IC50
  Tab Delimited (TSV)   2D SDfile   Computed 3D by Vconf -m prep SDfile
Find this compound or compounds like it in BindingDB:
Activity Spreadsheet -- Enzyme Inhibition Constant Data from BindingDB
Found 1 hit for monomerid = 50009624
TargetRenin(Homo sapiens (Human))
Merck Sharp And Dohme Research Laboratories
Curated by ChEMBL
LigandPNGBDBM50009624(CHEMBL327811 | [1-(13-Cyclohexylmethyl-11,12-dihyd...)
Affinity DataIC50: >2.00E+4nMpH: 7.4Assay Description:The compound was evaluated in vitro for inhibition of human plasma renin at pH 7.4.
In DepthDetails ArticlePubMed