BDBM50009805 CHEMBL20115::[3-(5-Fluoro-7-trifluoromethyl-benzothiazol-2-ylmethyl)-4-oxo-3,4-dihydro-phthalazin-1-yl]-acetic acid
SMILES OC(=O)Cc1nn(Cc2nc3cc(F)cc(c3s2)C(F)(F)F)c(=O)c2ccccc12
InChI Key InChIKey=RCDQNZCVJPOULL-UHFFFAOYSA-N
Data  1 IC50
  Tab Delimited (TSV)   2D SDfile   Computed 3D by Vconf -m prep SDfile
Find this compound or compounds like it in BindingDB:
Activity Spreadsheet -- Enzyme Inhibition Constant Data from BindingDB
Found 1 hit for monomerid = 50009805
TargetAldo-keto reductase family 1 member B1(Homo sapiens (Human))
Pfizer
Curated by ChEMBL
LigandPNGBDBM50009805(CHEMBL20115 | [3-(5-Fluoro-7-trifluoromethyl-benzo...)
Affinity DataIC50:  100nM. Assay description: Inhibition of aldose reductase (aldo-keto reductase, AKR1B1) isolated from human placenta.
In DepthDetails ArticlePubMed