BDBM50009812 CHEMBL20199::[3-(5-Methanesulfonyl-benzothiazol-2-ylmethyl)-4-oxo-3,4-dihydro-phthalazin-1-yl]-acetic acid
SMILES CS(=O)(=O)c1ccc2sc(Cn3nc(CC(O)=O)c4ccccc4c3=O)nc2c1
InChI Key InChIKey=WBRSNTPRBXONMJ-UHFFFAOYSA-N
Data  1 IC50
  Tab Delimited (TSV)   2D SDfile   Computed 3D by Vconf -m prep SDfile
Find this compound or compounds like it in BindingDB:
Activity Spreadsheet -- Enzyme Inhibition Constant Data from BindingDB
Found 1 hit for monomerid = 50009812
TargetAldo-keto reductase family 1 member B1(Homo sapiens (Human))
Pfizer
Curated by ChEMBL
LigandPNGBDBM50009812(CHEMBL20199 | [3-(5-Methanesulfonyl-benzothiazol-2...)
Affinity DataIC50:  1.70E+3nM. Assay description: Inhibition of aldose reductase (aldo-keto reductase, AKR1B1) isolated from human placenta.
In DepthDetails ArticlePubMed