BDBM50009866 CHEMBL275312::[3-(4-Methoxy-benzoyl)-2-methyl-indol-1-yl]-acetic acid
SMILES COc1ccc(cc1)C(=O)c1c(C)n(CC(O)=O)c2ccccc12
InChI Key InChIKey=JSWXCHVKZONBOA-UHFFFAOYSA-N
Data  1 IC50
  Tab Delimited (TSV)   2D SDfile   Computed 3D by Vconf -m prep SDfile
Find this compound or compounds like it in BindingDB:
Activity Spreadsheet -- Enzyme Inhibition Constant Data from BindingDB
Found 1 hit for monomerid = 50009866
TargetProstaglandin-H2 D-isomerase(Mus musculus)
Sterling Research Group
Curated by ChEMBL
LigandPNGBDBM50009866(CHEMBL275312 | [3-(4-Methoxy-benzoyl)-2-methyl-ind...)
Affinity DataIC50:  1.00E+4nM. Assay description: Concentration required to inhibit 50% activity of prostaglandin synthetase was determined in vitro in mouse brain microsomes
In DepthDetails ArticlePubMed