BDBM50009869 (4-Methoxy-phenyl)-[2-methyl-1-(2-piperazin-1-yl-ethyl)-1H-indol-3-yl]-methanone::CHEMBL12955
SMILES COc1ccc(cc1)C(=O)c1c(C)n(CCN2CCNCC2)c2ccccc12
InChI Key InChIKey=ZBCDWBYXYFIYSV-UHFFFAOYSA-N
Data  1 IC50
  Tab Delimited (TSV)   2D SDfile   Computed 3D by Vconf -m prep SDfile
Find this compound or compounds like it in BindingDB:
Activity Spreadsheet -- Enzyme Inhibition Constant Data from BindingDB
Found 1 hit for monomerid = 50009869
TargetProstaglandin-H2 D-isomerase(Mus musculus)
Sterling Research Group
Curated by ChEMBL
LigandPNGBDBM50009869((4-Methoxy-phenyl)-[2-methyl-1-(2-piperazin-1-yl-e...)
Affinity DataIC50:  1.40E+3nM. Assay description: Concentration required to inhibit 50% activity of prostaglandin synthetase was determined in vitro in mouse brain microsomes
In DepthDetails ArticlePubMed