BDBM50009884 CHEMBL279921::N-[1-{4-[2-(2-Amino-ethyl)-morpholin-4-yl]-1-cyclohexylmethyl-2-hydroxy-4-oxo-butylcarbamoyl}-2-(3H-imidazol-4-yl)-ethyl]-2-(morpholine-4-sulfonylamino)-3-phenyl-propionamide
SMILES NCCC1CN(CCO1)C(=O)C[C@H](O)C(CC1CCCCC1)NC(=O)C(Cc1cnc[nH]1)NC(=O)C(Cc1ccccc1)NS(=O)(=O)N1CCOCC1
InChI Key InChIKey=CQKVNPXXMLGRSE-HUFZRYMBSA-N
Data  2 IC50
  Tab Delimited (TSV)   2D SDfile   Computed 3D by Vconf -m prep SDfile
Find this compound or compounds like it in BindingDB:
Activity Spreadsheet -- Enzyme Inhibition Constant Data from BindingDB
Found 2 hits for monomerid = 50009884
TargetRenin(Homo sapiens (Human))
Warner-Lambert
Curated by ChEMBL
LigandPNGBDBM50009884(CHEMBL279921 | N-[1-{4-[2-(2-Amino-ethyl)-morpholi...)
Affinity DataIC50:  5.40nM. Assay description: Inhibitory activity against human plasma renin
In DepthDetails ArticlePubMed
TargetRenin(Homo sapiens (Human))
Warner-Lambert
Curated by ChEMBL
LigandPNGBDBM50009884(CHEMBL279921 | N-[1-{4-[2-(2-Amino-ethyl)-morpholi...)
Affinity DataIC50:  5nM. Assay description: Inhibitory activity against monkey plasma renin.
In DepthDetails ArticlePubMed