BDBM50009885 6-(3-Methyl-thioureido)-2-[2-(morpholine-4-sulfonylamino)-3-phenyl-propionylamino]-hex-4-ynoic acid {4-[2-(2-amino-ethyl)-morpholin-4-yl]-1-cyclohexylmethyl-2-hydroxy-4-oxo-butyl}-amide::CHEMBL281153
SMILES CNC(=S)NCC#CCC(NC(=O)C(Cc1ccccc1)NS(=O)(=O)N1CCOCC1)C(=O)NC(CC1CCCCC1)[C@@H](O)CC(=O)N1CCOC(CCN)C1
InChI Key InChIKey=PMGOEWJGCKXYHF-XMCIUJAFSA-N
Data  1 IC50
  Tab Delimited (TSV)   2D SDfile   Computed 3D by Vconf -m prep SDfile
Find this compound or compounds like it in BindingDB:
Activity Spreadsheet -- Enzyme Inhibition Constant Data from BindingDB
Found 1 hit for monomerid = 50009885
TargetRenin(Homo sapiens (Human))
Warner-Lambert
Curated by ChEMBL
LigandPNGBDBM50009885(6-(3-Methyl-thioureido)-2-[2-(morpholine-4-sulfony...)
Affinity DataIC50:  3.30nM. Assay description: Inhibitory activity against monkey plasma renin.
In DepthDetails ArticlePubMed