BDBM50009956 4-(2-Methoxy-ethyl)-5-methyl-1-phenyl-pyrazolidin-3-one::CHEMBL41520
SMILES COCCC1C(C)N(NC1=O)c1ccccc1
InChI Key InChIKey=UUUUAPAAJAPXRS-UHFFFAOYSA-N
Data  1 IC50
  Tab Delimited (TSV)   2D SDfile   Computed 3D by Vconf -m prep SDfile
Find this compound or compounds like it in BindingDB:
Activity Spreadsheet -- Enzyme Inhibition Constant Data from BindingDB
Found 1 hit for monomerid = 50009956
TargetPolyunsaturated fatty acid 5-lipoxygenase(Rattus norvegicus)
Sterling Research Group
Curated by ChEMBL
LigandPNGBDBM50009956(4-(2-Methoxy-ethyl)-5-methyl-1-phenyl-pyrazolidin-...)
Affinity DataIC50:  500nM. Assay description: In vitro inhibition of rat 5-Lipoxygenase
In DepthDetails ArticlePubMed