BDBM50009957 4-Methoxymethyl-1-phenyl-pyrazolidin-3-one::CHEMBL39154
SMILES COCC1CN(NC1=O)c1ccccc1
InChI Key InChIKey=FTUMALFXPIWCTM-UHFFFAOYSA-N
Data  1 IC50
  Tab Delimited (TSV)   2D SDfile   Computed 3D by Vconf -m prep SDfile
Find this compound or compounds like it in BindingDB:
Activity Spreadsheet -- Enzyme Inhibition Constant Data from BindingDB
Found 1 hit for monomerid = 50009957
TargetPolyunsaturated fatty acid 5-lipoxygenase(Rattus norvegicus)
Sterling Research Group
Curated by ChEMBL
LigandPNGBDBM50009957(4-Methoxymethyl-1-phenyl-pyrazolidin-3-one | CHEMB...)
Affinity DataIC50:  590nM. Assay description: In vitro inhibition of rat 5-Lipoxygenase
In DepthDetails ArticlePubMed