BDBM50009993 CHEMBL67410::[4-(3-Phenyl-propionylamino)-benzoylamino]-acetic acid
SMILES OC(=O)CNC(=O)c1ccc(NC(=O)CCc2ccccc2)cc1
InChI Key InChIKey=OBKUKGZZSPNFIH-UHFFFAOYSA-N
Data  1 IC50
  Tab Delimited (TSV)   2D SDfile   Computed 3D by Vconf -m prep SDfile
Find this compound or compounds like it in BindingDB:
Activity Spreadsheet -- Enzyme Inhibition Constant Data from BindingDB
Found 1 hit for monomerid = 50009993
TargetAldo-keto reductase family 1 member B1(Rattus norvegicus)
Auburn University
Curated by ChEMBL
LigandPNGBDBM50009993(CHEMBL67410 | [4-(3-Phenyl-propionylamino)-benzoyl...)
Affinity DataIC50:  4.50E+4nM. Assay description: Inhibitory activity against aldose reductase in rat lens
In DepthDetails ArticlePubMed