BDBM50010019 CHEMBL145656
SMILES NC(=N)c1ccc2[nH]c(CCCc3nc4cc(ccc4[nH]3)C(N)=N)nc2c1
InChI Key InChIKey=JSWDSBAWSDFTEK-UHFFFAOYSA-N
Data  2 KI
  Tab Delimited (TSV)   2D SDfile   Computed 3D by Vconf -m prep SDfile
Find this compound or compounds like it in BindingDB:
Activity Spreadsheet -- Enzyme Inhibition Constant Data from BindingDB
Found 2 hits for monomerid = 50010019
TargetProthrombin(Bos taurus (Bovine))
TBA
Curated by ChEMBL
LigandPNGBDBM50010019(CHEMBL145656)
Affinity DataKi:  7.90E+4nM. Assay description: Competitive reversible inhibition of bovine thrombin using alpha-N-benzoyl-DL-arginine-p-nitroanilide hydrochloride as substrate after 15 to 40 mins ...
In DepthDetails ArticlePubMed
TargetGlandular kallikrein(Sus scrofa)
TBA
Curated by ChEMBL
LigandPNGBDBM50010019(CHEMBL145656)
Affinity DataKi:  1.41E+5nM. Assay description: Competitive reversible inhibition of porcine pancreatic kallikrein using alpha-N-benzoyl-DL-arginine-p-nitroanilide hydrochloride as substrate after ...
In DepthDetails ArticlePubMed