BDBM50010117 CHEMBL3245405
SMILES NC(=N)c1ccc(OCCCCCOc2cccc(c2)[N+]([O-])=O)cc1
InChI Key InChIKey=ARTYOKRXOPQAPY-UHFFFAOYSA-N
Data  1 KI
  Tab Delimited (TSV)   2D SDfile   Computed 3D by Vconf -m prep SDfile
Find this compound or compounds like it in BindingDB:
Activity Spreadsheet -- Enzyme Inhibition Constant Data from BindingDB
Found 1 hit for monomerid = 50010117
TargetAcrosin(Sus scrofa)
TBA
Curated by ChEMBL
LigandPNGBDBM50010117(CHEMBL3245405)
Affinity DataKi:  1.10E+3nM. Assay description: Reversible competitive inhibition of boar spermatozoa acrosin using BzArgOEt as substrate by Dixon plot analysis
In DepthDetails ArticlePubMed