BDBM50010433 BOC-Phe-His-Leu-psi-[CHOHCH2]Val-Ile-His-OH::CHEMBL446156
SMILES CC[C@H](C)[C@H](NC(=O)[C@@H](C[C@H](O)[C@H](CC(C)C)NC(=O)[C@H](Cc1cnc[nH]1)NC(=O)[C@H](Cc1ccccc1)NC(=O)OC(C)(C)C)C(C)C)C(=O)N[C@@H](Cc1cnc[nH]1)C(O)=O
InChI Key InChIKey=NJVQLRCYVPVJIW-IFUGPJDHSA-N
Data  1 IC50
  Tab Delimited (TSV)   2D SDfile   Computed 3D by Vconf -m prep SDfile
Find this compound or compounds like it in BindingDB:
Activity Spreadsheet -- Enzyme Inhibition Constant Data from BindingDB
Found 1 hit for monomerid = 50010433
TargetRenin(Homo sapiens (Human))
E. Merck Darmstadt
Curated by ChEMBL
LigandPNGBDBM50010433(BOC-Phe-His-Leu-psi-[CHOHCH2]Val-Ile-His-OH | CHEM...)
Affinity DataIC50:  2.40nM. Assay description: The compound was tested in vitro for inhibitory activity against human renin
In DepthDetails ArticlePubMed