BDBM50010493 Benzyloxycarbonyl-Asn-Phe-[S]-[CH(OH)CH2N]-decahydroisoquinolin-3-yl-carbonyloxy-Ile-Val-OMe::CHEMBL262044
SMILES CC[C@H](C)[C@H](NC(=O)C1CC2CCCCC2CN1C[C@H](O)[C@H](Cc1ccccc1)NC(=O)[C@H](CC(N)=O)NC(=O)OCc1ccccc1)C(=O)N[C@@H](C(C)C)C(=O)OC
InChI Key InChIKey=VZTWVLFUCLYKNM-AVLUFRSQSA-N
Data  2 IC50
  Tab Delimited (TSV)   2D SDfile   Computed 3D by Vconf -m prep SDfile
Find this compound or compounds like it in BindingDB:
Activity Spreadsheet -- Enzyme Inhibition Constant Data from BindingDB
Found 2 hits for monomerid = 50010493
TargetGag-Pol polyprotein [489-587](Human immunodeficiency virus type 1)
Roche Products
Curated by ChEMBL
LigandPNGBDBM50010493(Benzyloxycarbonyl-Asn-Phe-[S]-[CH(OH)CH2N]-decahyd...)
Affinity DataIC50: >100nM. Assay description: Binding activity against HIV-1 Protease
In DepthDetails ArticlePubMed
TargetGag-Pol polyprotein [489-587](Human immunodeficiency virus type 1)
Roche Products
Curated by ChEMBL
LigandPNGBDBM50010493(Benzyloxycarbonyl-Asn-Phe-[S]-[CH(OH)CH2N]-decahyd...)
Affinity DataIC50: >100nM. Assay description: Binding activity against HIV-1 Protease
In DepthDetails ArticlePubMed