BDBM50010539 CHEMBL406034::MeTyr-Gly-Azgly-Phe-Leu-Arg-Arg-D-Leu-NH2
SMILES CN[C@@H](Cc1ccc(O)cc1)C(=O)NCC(=O)NNC(=O)N[C@@H](Cc1ccccc1)C(=O)N[C@@H](CC(C)C)C(=O)N[C@@H](CCCNC(N)=N)C(=O)N[C@@H](CCCNC(N)=N)C(=O)N[C@@H](CC(C)C)C(N)=O
InChI Key InChIKey=RQXXCFZBIBPJMF-NGTAMTFRSA-N
Data  3 IC50
  Tab Delimited (TSV)   2D SDfile   Computed 3D by Vconf -m prep SDfile
Find this compound or compounds like it in BindingDB:
Activity Spreadsheet -- Enzyme Inhibition Constant Data from BindingDB
Found 3 hits for monomerid = 50010539
TargetKappa-type opioid receptor(Homo sapiens (Human))
Eisai
Curated by ChEMBL
LigandPNGBDBM50010539(CHEMBL406034 | MeTyr-Gly-Azgly-Phe-Leu-Arg-Arg-D-L...)
Affinity DataIC50:  152nM. Assay description: Evaluated for inhibitory activity against Opioid receptor kappa 1 of rabbit vas deferens (RVD)
In DepthDetails ArticlePubMed
TargetDelta-type opioid receptor(MOUSE)
Eisai
Curated by ChEMBL
LigandPNGBDBM50010539(CHEMBL406034 | MeTyr-Gly-Azgly-Phe-Leu-Arg-Arg-D-L...)
Affinity DataIC50:  62nM. Assay description: Evaluated for inhibitory activity against Opioid receptor delta 1 of mouse vas deferens (MVD).
In DepthDetails ArticlePubMed
TargetMu-type opioid receptor(GUINEA PIG)
Eisai
Curated by ChEMBL
LigandPNGBDBM50010539(CHEMBL406034 | MeTyr-Gly-Azgly-Phe-Leu-Arg-Arg-D-L...)
Affinity DataIC50:  19nM. Assay description: Evaluated for inhibitory activity against Opioid receptor mu 1 of guinea pig ileum (GPI)
In DepthDetails ArticlePubMed