BDBM50010626 6-Benzyloxy-4-ethyl-9H-beta-carboline-3-carboxylic acid ethyl ester::CHEMBL273464
SMILES CCOC(=O)c1[nH]cc2nc3ccc(OCc4ccccc4)cc3c2c1CC
InChI Key InChIKey=IKXSFQFVTQDDAR-UHFFFAOYSA-N
Data  10 KI
  Tab Delimited (TSV)   2D SDfile   Computed 3D by Vconf -m prep SDfile
Find this compound or compounds like it in BindingDB:
Activity Spreadsheet -- Enzyme Inhibition Constant Data from BindingDB
Found 10 hits for monomerid = 50010626
TargetGamma-aminobutyric acid receptor subunit alpha-1/beta-3/gamma-2(Homo sapiens (Human))
University Of Wisconsin-Milwaukee
Curated by ChEMBL
LigandPNGBDBM50010626(6-Benzyloxy-4-ethyl-9H-beta-carboline-3-carboxylic...)
Affinity DataKi:  20.8nM. Assay description: Binding affinity measured using LtK- cell membranes expressing GABA alpha1-beta3-gamma2 receptor
Target InfoGoogleScholar
In DepthDetails ArticlePubMed
TargetGamma-aminobutyric acid receptor subunit alpha-1/beta-3/gamma-2(Homo sapiens (Human))
University Of Wisconsin-Milwaukee
Curated by ChEMBL
LigandPNGBDBM50010626(6-Benzyloxy-4-ethyl-9H-beta-carboline-3-carboxylic...)
Affinity DataKi:  21nM. Assay description: Binding affinity for human recombinant gamma-aminobutyric-acid (GABA) A receptor alpha-1-beta-3-gamma-2
Target InfoGoogleScholar
In DepthDetails ArticlePubMed
TargetGamma-aminobutyric acid receptor subunit alpha-3/beta-3/gamma-2(Homo sapiens (Human))
University Of Wisconsin-Milwaukee
Curated by ChEMBL
LigandPNGBDBM50010626(6-Benzyloxy-4-ethyl-9H-beta-carboline-3-carboxylic...)
Affinity DataKi:  59nM. Assay description: Binding affinity measured using LtK- cell membranes expressing GABA alpha3-beta3-gamma2 receptor
In DepthDetails ArticlePubMed
TargetGamma-aminobutyric acid receptor subunit alpha-3/beta-3/gamma-2(Homo sapiens (Human))
University Of Wisconsin-Milwaukee
Curated by ChEMBL
LigandPNGBDBM50010626(6-Benzyloxy-4-ethyl-9H-beta-carboline-3-carboxylic...)
Affinity DataKi:  59nM. Assay description: Binding affinity for human recombinant gamma-aminobutyric-acid (GABA) A receptor alpha-3-beta-3-gamma-2
In DepthDetails ArticlePubMed
TargetGABA-A receptor; alpha-5/beta-3/gamma-2(Homo sapiens (Human))
University Of Wisconsin-Milwaukee
Curated by ChEMBL
LigandPNGBDBM50010626(6-Benzyloxy-4-ethyl-9H-beta-carboline-3-carboxylic...)
Affinity DataKi:  67nM. Assay description: Binding affinity for human recombinant gamma-aminobutyric-acid (GABA) A receptor alpha-5-beta-3-gamma-2
In DepthDetails ArticlePubMed
TargetGABA-A receptor; alpha-5/beta-3/gamma-2(Homo sapiens (Human))
University Of Wisconsin-Milwaukee
Curated by ChEMBL
LigandPNGBDBM50010626(6-Benzyloxy-4-ethyl-9H-beta-carboline-3-carboxylic...)
Affinity DataKi:  67.3nM. Assay description: Binding affinity measured using LtK- cell membranes expressing Gamma-aminobutyric-acid A receptor alpha5-beta3-gamma2
In DepthDetails ArticlePubMed
TargetGABA-A receptor; alpha-2/beta-3/gamma-2(Homo sapiens (Human))
University Of Wisconsin-Milwaukee
Curated by ChEMBL
LigandPNGBDBM50010626(6-Benzyloxy-4-ethyl-9H-beta-carboline-3-carboxylic...)
Affinity DataKi:  78nM. Assay description: Binding affinity to human recombinant gamma-aminobutyric-acid (GABA) A receptor alpha-2-beta-3-gamma-2
In DepthDetails ArticlePubMed
TargetGABA-A receptor; alpha-2/beta-3/gamma-2(Homo sapiens (Human))
University Of Wisconsin-Milwaukee
Curated by ChEMBL
LigandPNGBDBM50010626(6-Benzyloxy-4-ethyl-9H-beta-carboline-3-carboxylic...)
Affinity DataKi:  78.3nM. Assay description: Binding affinity measured using LtK- cell membranes expressing GABA alpha2-beta3-gamma2 receptor
In DepthDetails ArticlePubMed
TargetGamma-aminobutyric acid receptor subunit alpha-6/beta-3/gamma-2(Homo sapiens (Human))
University Of Wisconsin-Milwaukee
Curated by ChEMBL
LigandPNGBDBM50010626(6-Benzyloxy-4-ethyl-9H-beta-carboline-3-carboxylic...)
Affinity DataKi: >1.00E+4nM. Assay description: Binding affinity measured using LtK- cell membranes expressing Gamma-aminobutyric-acid A receptor alpha6-beta3-gamma2
In DepthDetails ArticlePubMed
TargetGamma-aminobutyric acid receptor subunit alpha-6/beta-3/gamma-2(Homo sapiens (Human))
University Of Wisconsin-Milwaukee
Curated by ChEMBL
LigandPNGBDBM50010626(6-Benzyloxy-4-ethyl-9H-beta-carboline-3-carboxylic...)
Affinity DataKi: >1.00E+4nM. Assay description: Binding affinity for human recombinant gamma-aminobutyric-acid (GABA) A receptor alpha-6-beta-3-gamma-2
In DepthDetails ArticlePubMed