BDBM50010727 5-Bromo-N-(1-ethyl-pyrrolidin-2-ylmethyl)-3-hydroxy-2-methoxy-benzamide::CHEMBL76266
SMILES CCN1CCCC1CNC(=O)c1cc(Br)cc(O)c1OC
InChI Key InChIKey=UVEHPRQRFSJENI-UHFFFAOYSA-N
Data  1 IC50
  Tab Delimited (TSV)   2D SDfile   Computed 3D by Vconf -m prep SDfile
Find this compound or compounds like it in BindingDB:
Activity Spreadsheet -- Enzyme Inhibition Constant Data from BindingDB
Found 1 hit for monomerid = 50010727
TargetD(2) dopamine receptor(Rattus norvegicus (rat))
Astra Research Centre
Curated by ChEMBL
LigandPNGBDBM50010727(5-Bromo-N-(1-ethyl-pyrrolidin-2-ylmethyl)-3-hydrox...)
Affinity DataIC50:  10nM. Assay description: The affinity for the Dopamine receptor D2 was assessed by the inhibition of [3H]-spiperone binding in rat striatal membranes in vitro.
In DepthDetails ArticlePubMed