BDBM50010761 CHEMBL553536::N-(17-Acetyl-10,13-dimethyl-2,3,4,7,8,9,10,11,12,13,14,15,16,17-tetradecahydro-1H-cyclopenta[a]phenanthren-3-yl)-N'-o-tolyl-guanidine; hydrochloride
SMILES CC(=O)[C@H]1CCC2C3CC=C4CC(CC[C@]4(C)C3CC[C@]12C)NC(N)=Nc1ccccc1C
InChI Key InChIKey=BFUBGEOPCXZUKU-QMIWCYQISA-N
Data  1 IC50
  Tab Delimited (TSV)   2D SDfile   Computed 3D by Vconf -m prep SDfile
Find this compound or compounds like it in BindingDB:
Activity Spreadsheet -- Enzyme Inhibition Constant Data from BindingDB
Found 1 hit for monomerid = 50010761
TargetSigma non-opioid intracellular receptor 1(Homo sapiens (Human))
University Of Oregon
Curated by ChEMBL
LigandPNGBDBM50010761(CHEMBL553536 | N-(17-Acetyl-10,13-dimethyl-2,3,4,7...)
Affinity DataIC50:  250nM. Assay description: In vitro inhibitory activity against [3H]DTG binding to Sigma opioid receptor in guinea pig brain membrane homogenates
In DepthDetails ArticlePubMed