BDBM50010886 1-[1-(4-Methoxy-phenyl)-2-pyrrolidin-1-yl-ethyl]-cyclohexanol(HCl)::CHEMBL99660
SMILES COc1ccc(cc1)C(CN1CCCC1)C1(O)CCCCC1
InChI Key InChIKey=NDYRKGXPDKOCHA-UHFFFAOYSA-N
Data  1 IC50
  Tab Delimited (TSV)   2D SDfile   Computed 3D by Vconf -m prep SDfile
Find this compound or compounds like it in BindingDB:
Activity Spreadsheet -- Enzyme Inhibition Constant Data from BindingDB
Found 1 hit for monomerid = 50010886
TargetAlpha-1A adrenergic receptor(Rattus norvegicus (Rat))
Wyeth-Ayerst Research
Curated by ChEMBL
LigandPNGBDBM50010886(1-[1-(4-Methoxy-phenyl)-2-pyrrolidin-1-yl-ethyl]-c...)
Affinity DataIC50: >1.00E+4nM. Assay description: Inhibition of binding of [3H]imipramine to imipramine receptor in rat brain
In DepthDetails ArticlePubMed