BDBM50011099 CHEMBL338977::Toluene-4-sulfonate3-[6-(4-hexadecyloxymethyl-tetrahydro-furan-2-ylmethoxy)-hexyl]-thiazol-3-ium;Toluene-4-sulfonate
SMILES CCCCCCCCCCCCCCCCOCC1COC(COCCCCCC[n+]2ccsc2)C1
InChI Key InChIKey=UXPHFNPUHVITRY-UHFFFAOYSA-N
Data  1 IC50
  Tab Delimited (TSV)   2D SDfile   Computed 3D by Vconf -m prep SDfile
Find this compound or compounds like it in BindingDB:
Activity Spreadsheet -- Enzyme Inhibition Constant Data from BindingDB
Found 1 hit for monomerid = 50011099
TargetPlatelet-activating factor receptor(Cavia porcellus)
J. Uriach & CíA.
Curated by ChEMBL
LigandPNGBDBM50011099(CHEMBL338977 | Toluene-4-sulfonate3-[6-(4-hexadecy...)
Affinity DataIC50:  540nM. Assay description: Inhibitory activity expressed as the concentration required to inhibit platelet-activating factor (PAF) induced maximum aggregation by 50%
In DepthDetails ArticlePubMed