BDBM50011117 4-[Acetyl-(4-hexadecyloxymethyl-tetrahydro-furan-2-ylmethoxycarbonyl)-amino]-1-ethyl-pyridinium; iodide::CHEMBL124562
SMILES CCCCCCCCCCCCCCCCOCC1COC(COC(=O)N(C(C)=O)c2cc[n+](CC)cc2)C1
InChI Key InChIKey=DWOVIYISQRWPOO-UHFFFAOYSA-N
Data  1 IC50
  Tab Delimited (TSV)   2D SDfile   Computed 3D by Vconf -m prep SDfile
Find this compound or compounds like it in BindingDB:
Activity Spreadsheet -- Enzyme Inhibition Constant Data from BindingDB
Found 1 hit for monomerid = 50011117
TargetPlatelet-activating factor receptor(Cavia porcellus)
J. Uriach & CíA.
Curated by ChEMBL
LigandPNGBDBM50011117(4-[Acetyl-(4-hexadecyloxymethyl-tetrahydro-furan-2...)
Affinity DataIC50:  860nM. Assay description: Inhibitory activity expressed as the concentration required to inhibit platelet-activating factor (PAF) induced maximum aggregation by 50%
In DepthDetails ArticlePubMed