BDBM50011226 8-[2-(4-Methoxy-phenyl)-1-methyl-ethyl]-1,3-dipropyl-3,7-dihydro-purine-2,6-dione::CHEMBL143710
SMILES CCCn1c2nc([nH]c2c(=O)n(CCC)c1=O)C(C)Cc1ccc(OC)cc1
InChI Key InChIKey=XXCDUJHWRBDDPB-UHFFFAOYSA-N
Data  2 KI
  Tab Delimited (TSV)   2D SDfile   Computed 3D by Vconf -m prep SDfile
Find this compound or compounds like it in BindingDB:
Activity Spreadsheet -- Enzyme Inhibition Constant Data from BindingDB
Found 2 hits for monomerid = 50011226
TargetAdenosine receptor A1(GUINEA PIG)
Kyowa Hakko Kogyo
Curated by ChEMBL
LigandPNGBDBM50011226(8-[2-(4-Methoxy-phenyl)-1-methyl-ethyl]-1,3-diprop...)
Affinity DataKi:  220nM. Assay description: Binding affinity carried out with [3H]-cyclohexyladenosine in guinea pig forebrain membranes against adenosine A1 receptor
In DepthDetails ArticlePubMed
TargetAdenosine receptor A2a/A2b(Rattus norvegicus)
Kyowa Hakko Kogyo
Curated by ChEMBL
LigandPNGBDBM50011226(8-[2-(4-Methoxy-phenyl)-1-methyl-ethyl]-1,3-diprop...)
Affinity DataKi:  580nM. Assay description: Binding affinity carried out with [3H]5'-(N-ethylcarbamoyl)-adenosine in the presence of 50 nM cyclopentyladenosine in rat striatal membranes against...
In DepthDetails ArticlePubMed