BDBM50011262 7-Dipropylamino-6-methyl-5,6,7,8-tetrahydro-naphthalen-1-ol; hydrochloride::CHEMBL542510
SMILES CCCN(CCC)[C@@H]1Cc2c(O)cccc2C[C@@H]1C
InChI Key InChIKey=YRGIQICNKWCKCO-XJKSGUPXSA-N
Data  1 KI
  Tab Delimited (TSV)   2D SDfile   Computed 3D by Vconf -m prep SDfile
Find this compound or compounds like it in BindingDB:
Activity Spreadsheet -- Enzyme Inhibition Constant Data from BindingDB
Found 1 hit for monomerid = 50011262
Target5-hydroxytryptamine receptor 1A(Rattus norvegicus (rat))
Uppsala University
Curated by ChEMBL
LigandPNGBDBM50011262(7-Dipropylamino-6-methyl-5,6,7,8-tetrahydro-naphth...)
Affinity DataKi:  394nM. Assay description: Binding affinity at 5-hydroxytryptamine 1A receptor by the displacement of [3H]8-OH-DPAT in rat brain.
In DepthDetails ArticlePubMed