BDBM50011305 CHEMBL3260724
SMILES OC[C@H]1O[C@H]([C@H](O)[C@@H]1O)n1cnc2c(NCC(c3ccccc3)c3ccccc3)nc(nc12)C(=O)NCCNC(=O)NC1CCN(CC1)c1ccccn1
InChI Key InChIKey=ZHQNOECYYOPOGK-AAAKGCLZSA-N
Data  1 KI
  Tab Delimited (TSV)   2D SDfile   Computed 3D by Vconf -m prep SDfile
Find this compound or compounds like it in BindingDB:
Activity Spreadsheet -- Enzyme Inhibition Constant Data from BindingDB
Found 1 hit for monomerid = 50011305
TargetAdenosine receptor A2a(Homo sapiens (Human))
Merck Research Laboratories
Curated by ChEMBL
LigandPNGBDBM50011305(CHEMBL3260724)
Affinity DataKi:  4nM. Assay description: Binding affinity to human recombinant adenosine receptor A2a
In DepthDetails ArticlePubMed