BDBM50011347 5-[2-{[2-(3-Amino-3-methyl-butyrylamino)-3-phenyl-propionyl]-methyl-amino}-3-(3H-imidazol-4-yl)-propionylamino]-6-cyclohexyl-4-hydroxy-2-isopropyl-hexanoic acid {2-methyl-1-[(pyridin-2-ylmethyl)-carbamoyl]-butyl}-amide::CHEMBL3143480
SMILES CC[C@H](C)[C@H](NC(=O)[C@@H](C[C@H](O)[C@H](CC1CCCCC1)NC(=O)[C@H](Cc1c[nH]cn1)N(C)C(=O)[C@H](Cc1ccccc1)NC(=O)CC(C)(C)N)C(C)C)C(=O)NCc1ccccn1
InChI Key InChIKey=HVUWIXKTJXRPID-UHFFFAOYSA-N
Data  1 IC50
  Tab Delimited (TSV)   2D SDfile   Computed 3D by Vconf -m prep SDfile
Find this compound or compounds like it in BindingDB:
Activity Spreadsheet -- Enzyme Inhibition Constant Data from BindingDB
Found 1 hit for monomerid = 50011347
TargetRenin(Homo sapiens (Human))
Upjohn
Curated by ChEMBL
LigandPNGBDBM50011347(5-[2-{[2-(3-Amino-3-methyl-butyrylamino)-3-phenyl-...)
Affinity DataIC50:  0.290nM. Assay description: Inhibition of human plasma renin.
In DepthDetails ArticlePubMed