BDBM50011448 4-Oxo-2-[4-(3,4,5-trimethoxy-benzoylamino)-phenyl]-4H-chromene-3-carboxylic acid methyl ester::CHEMBL354823
SMILES COC(=O)c1c(oc2ccccc2c1=O)-c1ccc(NC(=O)c2cc(OC)c(OC)c(OC)c2)cc1
InChI Key InChIKey=CKWMQEFCANUOOZ-UHFFFAOYSA-N
Data  1 IC50
  Tab Delimited (TSV)   2D SDfile   Computed 3D by Vconf -m prep SDfile
Find this compound or compounds like it in BindingDB:
Activity Spreadsheet -- Enzyme Inhibition Constant Data from BindingDB
Found 1 hit for monomerid = 50011448
TargetTyrosine-protein kinase Lck(Homo sapiens (Human))
Purdue University
Curated by ChEMBL
LigandPNGBDBM50011448(4-Oxo-2-[4-(3,4,5-trimethoxy-benzoylamino)-phenyl]...)
Affinity DataIC50: >2.00E+6nM. Assay description: Ability to inhibit protein-tyrosine kinase activity of p56lck (isolated from bovine thymus) in vitro.
In DepthDetails ArticlePubMed