BDBM50011662 2-(3-Carbazol-9-yl-prop-1-ynyl)-4-(2-chloro-phenyl)-9-methyl-6H-1-thia-5,7,8,9a-tetraaza-cyclopenta[e]azulene::CHEMBL20701
SMILES Cc1nnc2CN=C(c3cc(sc3-n12)C#CCn1c2ccccc2c2ccccc12)c1ccccc1Cl
InChI Key InChIKey=JUKIVZUCZPNASX-UHFFFAOYSA-N
Data  1 IC50
  Tab Delimited (TSV)   2D SDfile   Computed 3D by Vconf -m prep SDfile
Find this compound or compounds like it in BindingDB:
Activity Spreadsheet -- Enzyme Inhibition Constant Data from BindingDB
Found 1 hit for monomerid = 50011662
TargetPlatelet-activating factor receptor(Homo sapiens (Human))
Roche Research Center
Curated by ChEMBL
LigandPNGBDBM50011662(2-(3-Carbazol-9-yl-prop-1-ynyl)-4-(2-chloro-phenyl...)
Affinity DataIC50:  120nM. Assay description: PAF-antagonist activity determined in dog platelets by PAF-binding assay
In DepthDetails ArticlePubMed