BDBM50011911 5-amino-2-aminomethyl-6-[4,6-diamino-3-(4-amino-6-bromomethyl-3,5-dihydroxytetrahydro-2H-2-pyranyloxy)-2-hydroxycyclohexyloxy]tetrahydro-2H-3,4-pyrandiol::CHEMBL286825
SMILES NCC1OC(OC2C(N)CC(N)C(OC3OC(CBr)C(O)C(N)C3O)C2O)C(N)C(O)C1O
InChI Key InChIKey=VEDDVUXLCWEEFQ-UHFFFAOYSA-N
Data  1 IC50
  Tab Delimited (TSV)   2D SDfile   Computed 3D by Vconf -m prep SDfile
Find this compound or compounds like it in BindingDB:
Activity Spreadsheet -- Enzyme Inhibition Constant Data from BindingDB
Found 1 hit for monomerid = 50011911
TargetAcyl-protein thioesterase 1(Rattus norvegicus)
Universit£
Curated by ChEMBL
LigandPNGBDBM50011911(5-amino-2-aminomethyl-6-[4,6-diamino-3-(4-amino-6-...)
Affinity DataIC50:  1.23E+5nM. Assay description: In vitro inhibition of lysosomal phospholipase activity for release of labeled lysophosphatidylcholine
In DepthDetails ArticlePubMed