BDBM50012942 6-Cyclohexyl-4-hydroxy-2-isopropyl-5-[2-(8-propyl-6-pyridin-3-yl-[1,2,4]triazolo[4,3-a]pyrazin-3-yl)-3-pyridin-3-yl-propionylamino]-hexanoic acid butyl-methyl-amide::CHEMBL307442
SMILES CCCCN(C)C(=O)C(CC(O)C(CC1CCCCC1)NC(=O)C(Cc1cccnc1)c1nnc2c(CCC)nc(cn12)-c1cccnc1)C(C)C
InChI Key InChIKey=NRFWVRGKWGXAIV-UHFFFAOYSA-N
Data  1 IC50
  Tab Delimited (TSV)   2D SDfile   Computed 3D by Vconf -m prep SDfile
Find this compound or compounds like it in BindingDB:
Activity Spreadsheet -- Enzyme Inhibition Constant Data from BindingDB
Found 1 hit for monomerid = 50012942
TargetRenin(Homo sapiens (Human))
Ici Pharmaceuticals Group
Curated by ChEMBL
LigandPNGBDBM50012942(6-Cyclohexyl-4-hydroxy-2-isopropyl-5-[2-(8-propyl-...)
Affinity DataIC50:  41nM. Assay description: Inhibition of human renin
In DepthDetails ArticlePubMed