BDBM50012966 8-[4-(4-Fluoro-2-iodo-phenyl)-4-oxo-butyl]-1-phenyl-1,3,8-triaza-spiro[4.5]decan-4-one (2-iodospiperone, 2'-ISP)::CHEMBL49405
SMILES Fc1ccc(C(=O)CCCN2CCC3(CC2)N(CNC3=O)c2ccccc2)c(I)c1
InChI Key InChIKey=WNZBTQBAZJTZST-UHFFFAOYSA-N
Data  1 Kd
  Tab Delimited (TSV)   2D SDfile   Computed 3D by Vconf -m prep SDfile
Find this compound or compounds like it in BindingDB:
Activity Spreadsheet -- Enzyme Inhibition Constant Data from BindingDB
Found 1 hit for monomerid = 50012966
TargetD(2) dopamine receptor(Rattus norvegicus (rat))
University Of Pennsylvania
Curated by ChEMBL
LigandPNGBDBM50012966(8-[4-(4-Fluoro-2-iodo-phenyl)-4-oxo-butyl]-1-pheny...)
Affinity DataKd:  0.25nM. Assay description: Evaluated in vivo for the affinity towards Dopamine receptor D2 of rat striatal tissue
In DepthDetails ArticlePubMed