BDBM50013087 2-(3-Chloro-4-fluoro-phenylamino)-1,9-dihydro-purin-6-one::CHEMBL296595
SMILES Fc1ccc(Nc2nc3nc[nH]c3c(=O)[nH]2)cc1Cl
InChI Key InChIKey=QCVDQVZWWDKIKH-UHFFFAOYSA-N
Data  4 IC50
  Tab Delimited (TSV)   2D SDfile   Computed 3D by Vconf -m prep SDfile
Find this compound or compounds like it in BindingDB:
Activity Spreadsheet -- Enzyme Inhibition Constant Data from BindingDB
Found 4 hits for monomerid = 50013087
TargetThymidine kinase(Human herpesvirus 1 (strain SC16) (HHV-1) (Human h...)
University Of Massachusetts Medical School
Curated by ChEMBL
LigandPNGBDBM50013087(2-(3-Chloro-4-fluoro-phenylamino)-1,9-dihydro-puri...)
Affinity DataIC50:  7.94E+3nM. Assay description: Inhibitory activity against HSV-1 thymidine kinase isolated from HeLa cells
In DepthDetails ArticlePubMed
TargetThymidine kinase(Human herpesvirus 2)
University Of Massachusetts Medical School
Curated by ChEMBL
LigandPNGBDBM50013087(2-(3-Chloro-4-fluoro-phenylamino)-1,9-dihydro-puri...)
Affinity DataIC50:  2.51E+3nM. Assay description: Inhibitory activity against HSV-2 thymidine kinase isolated from HeLa cells
In DepthDetails ArticlePubMed
TargetThymidine kinase(Human herpesvirus 1 (strain SC16) (HHV-1) (Human h...)
University Of Massachusetts Medical School
Curated by ChEMBL
LigandPNGBDBM50013087(2-(3-Chloro-4-fluoro-phenylamino)-1,9-dihydro-puri...)
Affinity DataIC50:  2.50E+3nM. Assay description: Inhibition of TdR phosphorylation using thymidine kinase assay for herpes simplex virus type 2
In DepthDetails ArticlePubMed
TargetThymidine kinase(Human herpesvirus 1)
University Of Massachusetts Medical School
Curated by ChEMBL
LigandPNGBDBM50013087(2-(3-Chloro-4-fluoro-phenylamino)-1,9-dihydro-puri...)
Affinity DataIC50:  8.00E+3nM. Assay description: Inhibition of TdR phosphorylation using thymidine kinase assay for herpes simplex virus type 1
In DepthDetails ArticlePubMed