BDBM50013137 CHEMBL3262290
SMILES Cn1cc(CCOc2nccnc2-c2cncnc2)c2nc3ccccc3cc12
InChI Key InChIKey=DRRKYESEMTWDAF-UHFFFAOYSA-N
Data  1 IC50
  Tab Delimited (TSV)   2D SDfile   Computed 3D by Vconf -m prep SDfile
Find this compound or compounds like it in BindingDB:
Activity Spreadsheet -- Enzyme Inhibition Constant Data from BindingDB
Found 1 hit for monomerid = 50013137
TargetcAMP and cAMP-inhibited cGMP 3',5'-cyclic phosphodiesterase 10A(Homo sapiens (Human))
Glenmark Pharmaceuticals
Curated by ChEMBL
LigandPNGBDBM50013137(CHEMBL3262290)
Affinity DataIC50:  123nM. Assay description: Inhibition of N-terminal GST-tagged human recombinant PDE10A assessed as substrate hydrolysis using [3H]cAMP as substrate after 30 mins by two-step r...
In DepthDetails ArticlePubMed