BDBM50013184 1H-Indole-2-carboxylic acid [5-(2-fluoro-phenyl)-1-methyl-2,3-dihydro-1H-benzo[e][1,4]diazepin-2-ylmethyl]-amide::CHEMBL343066
SMILES CN1C(CNC(=O)c2cc3ccccc3[nH]2)CN=C(c2ccccc2F)c2ccccc12
InChI Key InChIKey=DBKVZDRDRZHBQM-UHFFFAOYSA-N
Data  3 IC50
  Tab Delimited (TSV)   2D SDfile   Computed 3D by Vconf -m prep SDfile
Find this compound or compounds like it in BindingDB:
Activity Spreadsheet -- Enzyme Inhibition Constant Data from BindingDB
Found 3 hits for monomerid = 50013184
LigandPNGBDBM50013184(1H-Indole-2-carboxylic acid [5-(2-fluoro-phenyl)-1...)
Affinity DataIC50:  0.300nM. Assay description: Displacement of [3H]dihydromorphine (DHM) from rat brain Opioid receptors
In DepthDetails ArticlePubMed
TargetCholecystokinin receptor type A(RAT)
Merck Sharp & Dohme Research Laboratories
Curated by ChEMBL
LigandPNGBDBM50013184(1H-Indole-2-carboxylic acid [5-(2-fluoro-phenyl)-1...)
Affinity DataIC50:  160nM. Assay description: Inhibition of binding of [125I]-CCK-8 to Cholecystokinin type A receptor in rat pancreas
In DepthDetails ArticlePubMed
TargetGastrin/cholecystokinin type B receptor(Homo sapiens (Human))
Merck Sharp & Dohme Research Laboratories
Curated by ChEMBL
LigandPNGBDBM50013184(1H-Indole-2-carboxylic acid [5-(2-fluoro-phenyl)-1...)
Affinity DataIC50:  1.55E+4nM. Assay description: Inhibition of binding of [125I]-CCK-8 to Cholecystokinin type B receptor in guinea pig brain tissues
In DepthDetails ArticlePubMed