BDBM50013214 (racemic)Sodium salt of7-[4-(4-Fluoro-phenyl)-2-isopropyl-5-methyl-1-phenyl-1H-pyrrol-3-yl]-3,5-dihydroxy-heptanoic acid::CHEMBL436037::Sodium salt of7-[4-(4-Fluoro-phenyl)-2-isopropyl-5-methyl-1-phenyl-1H-pyrrol-3-yl]-3R,5R-dihydroxy-heptanoic acid
SMILES CC(C)c1c(CC[C@@H](O)C[C@@H](O)CC([O-])=O)c(c(C)n1-c1ccccc1)-c1ccc(F)cc1
InChI Key InChIKey=JHURQXGATCGLIV-DHIUTWEWSA-M
Data  2 IC50
  Tab Delimited (TSV)   2D SDfile   Computed 3D by Vconf -m prep SDfile
Find this compound or compounds like it in BindingDB:
Activity Spreadsheet -- Enzyme Inhibition Constant Data from BindingDB
Found 2 hits for monomerid = 50013214
Target3-hydroxy-3-methylglutaryl-coenzyme A reductase(Rattus norvegicus (rat))
Hoechst
Curated by ChEMBL
LigandPNGBDBM50013214((racemic)Sodium salt of7-[4-(4-Fluoro-phenyl)-2-is...)
Affinity DataIC50:  5nM. Assay description: In vitro inhibition of HMG-CoA reductase of rat liver
In DepthDetails ArticlePubMed
Target3-hydroxy-3-methylglutaryl-coenzyme A reductase(Rattus norvegicus (rat))
Hoechst
Curated by ChEMBL
LigandPNGBDBM50013214((racemic)Sodium salt of7-[4-(4-Fluoro-phenyl)-2-is...)
Affinity DataIC50:  5nM. Assay description: In vitro inhibition of HMG-CoA reductase of rat liver
In DepthDetails ArticlePubMed