BDBM50013984 2-(4-Bromo-phenyl)-N-methyl-N-(2-pyrrolidin-1-yl-cyclohexyl)-acetamide
SMILES CN(C1CCCC[C@@H]1N1CCCC1)C(=O)Cc1ccc(Br)cc1
InChI Key InChIKey=HRGUDLWQAMLSOY-ZVAWYAOSSA-N
Data  1 IC50
  Tab Delimited (TSV)   2D SDfile   Computed 3D by Vconf -m prep SDfile
Find this compound or compounds like it in BindingDB:
Activity Spreadsheet -- Enzyme Inhibition Constant Data from BindingDB
Found 1 hit for monomerid = 50013984
TargetSigma non-opioid intracellular receptor 1(Homo sapiens (Human))
National Institute Of Diabetes And Digestive And Kidney Diseases
Curated by ChEMBL
LigandPNGBDBM50013984(2-(4-Bromo-phenyl)-N-methyl-N-(2-pyrrolidin-1-yl-c...)
Affinity DataIC50:  228nM. Assay description: Binding affinity for sigma opioid receptor using [3H](+)-3-PPP as radioligand
In DepthDetails ArticlePubMed