BDBM50014102 Boc-Pro-Phe-N(Me) His-Leu[CHOHCH2]Val-Ile-THAM Amide::CHEMBL177904
SMILES CC[C@H](C)[C@H](NC(=O)[C@H](C[C@H](O)[C@H](CC(C)C)NC(=O)[C@H](Cc1cnc[nH]1)N(C)C(=O)[C@H](Cc1ccccc1)NC(=O)[C@@H]1CCCN1C(=O)OC(C)(C)C)C(C)C)C(=O)NC(CO)(CO)CO
InChI Key InChIKey=CFRMVYLVKVUAHT-BXJXOLQHSA-N
Data  1 IC50
  Tab Delimited (TSV)   2D SDfile   Computed 3D by Vconf -m prep SDfile
Find this compound or compounds like it in BindingDB:
Activity Spreadsheet -- Enzyme Inhibition Constant Data from BindingDB
Found 1 hit for monomerid = 50014102
TargetRenin(Rattus norvegicus)
Upjohn
Curated by ChEMBL
LigandPNGBDBM50014102(Boc-Pro-Phe-N(Me) His-Leu[CHOHCH2]Val-Ile-THAM Ami...)
Affinity DataIC50:  0.260nM. Assay description: Tested invitro for inhibitory activity against plasma renin in rat models
In DepthDetails ArticlePubMed