BDBM50014322 13-Methyl-10-propyl-1,6,7,8,9,10,11,12,13,14,15,16-dodecahydro-2H-cyclopenta[a]phenanthrene-3,17-dione::CHEMBL101595
SMILES CCC[C@]12CCC(=O)C=C1CCC1C3CCC(=O)[C@@]3(C)CCC21
InChI Key InChIKey=VGXUJXXKBNEKRI-CEJNIXRPSA-N
Data  1 KI
  Tab Delimited (TSV)   2D SDfile   Computed 3D by Vconf -m prep SDfile
Find this compound or compounds like it in BindingDB:
Activity Spreadsheet -- Enzyme Inhibition Constant Data from BindingDB
Found 1 hit for monomerid = 50014322
TargetAromatase(Homo sapiens (Human))
Johns Hopkins University School Of Medicine
Curated by ChEMBL
LigandPNGBDBM50014322(13-Methyl-10-propyl-1,6,7,8,9,10,11,12,13,14,15,16...)
Affinity DataKi:  3.00E+3nM. Assay description: Binding affinity was measured on Cytochrome P450 19A1
In DepthDetails ArticlePubMed