BDBM50014490 (S)-2-(4-(((2-(hydroxymethyl)-4-oxo-3,4-dihydroquinazolin-6-yl)methyl)(methyl)amino)benzamido)pentanedioic acid::2-{4-[(2-Hydroxymethyl-4-oxo-3,4-dihydro-quinazolin-6-ylmethyl)-methyl-amino]-benzoylamino}-pentanedioic acid::CHEMBL321284
SMILES CN(Cc1ccc2nc(CO)[nH]c(=O)c2c1)c1ccc(cc1)C(=O)N[C@@H](CCC(O)=O)C(O)=O
InChI Key InChIKey=KYDGECOJEBVKCG-SFHVURJKSA-N
Data  2 IC50
  Tab Delimited (TSV)   2D SDfile   Computed 3D by Vconf -m prep SDfile
Find this compound or compounds like it in BindingDB:
Activity Spreadsheet -- Enzyme Inhibition Constant Data from BindingDB
Found 2 hits for monomerid = 50014490
TargetThymidylate synthase(Homo sapiens (Human))
Meerut Institute Of Engineering And Technology
Curated by ChEMBL
LigandPNGBDBM50014490((S)-2-(4-(((2-(hydroxymethyl)-4-oxo-3,4-dihydroqui...)
Affinity DataIC50:  646nM. Assay description: Inhibition of thymidylate synthase
In DepthDetails ArticlePubMed
TargetThymidylate synthase(Mus musculus)
Ici Pharmaceuticals Group
Curated by ChEMBL
LigandPNGBDBM50014490((S)-2-(4-(((2-(hydroxymethyl)-4-oxo-3,4-dihydroqui...)
Affinity DataIC50:  640nM. Assay description: Concentration required for in vitro inhibition of thymidylate synthase
In DepthDetails ArticlePubMed